"River Basin District","Management Catchment","Operational Catchment","Water Body","Water Body ID","Water Body Type","Ngr","Hydromorphological designation","Easting","Northing","Cycle","Classification Status","Classification Level","Classification Element","Category","Category Certainty","Reason Type","Business Sector","Swmi","Swmi Certainty","Activity","Activity Certainty","Pressure Tier 1","Pressure Tier 2","ID","Rnag URL","Pressure Tier 3","National Swmi Header"
"Humber","Louth Grimsby and Ancholme","Becks Northern","North Beck Drain","GB104029067575","River","TA1934012096","heavily modified","519340","412096","3","Moderate or less","Element","Mitigation Measures Assessment","Local and Central Government","Confirmed","RNAG","Not applicable","Physical modification","Confirmed","Other (not in list, must add details in comments)","Confirmed","Flood protection",,"552302","/catchment-planning/ReasonsForNotAchievingGood/552302","Physical modification","Physical modifications"
"Humber","Louth Grimsby and Ancholme","Becks Northern","Louth Canal","GB104029061990","River","TF3703694260","heavily modified","537036","394260","3","Fail","Element","Polybrominated diphenyl ethers (PBDE)","No sector responsible","Not applicable","RNAG","Not applicable","measures delivered to address reason, awaiting recovery","Confirmed","Not applicable","Not applicable",,,"582116","/catchment-planning/ReasonsForNotAchievingGood/582116","Chemicals",
"Humber","Louth Grimsby and Ancholme","Becks Northern","New Dike Catchment (trib of Louth Canal)","GB104029062030","River","TF3277399099","heavily modified","532773","399099","3","Moderate or less","Element","Mitigation Measures Assessment","Local and Central Government","Confirmed","RNAG","Not applicable","Physical modification","Confirmed","Other (not in list, must add details in comments)","Confirmed","Flood protection",,"548649","/catchment-planning/ReasonsForNotAchievingGood/548649","Physical modification","Physical modifications"
"Humber","Louth Grimsby and Ancholme","Becks Northern","New Dike Catchment (trib of Louth Canal)","GB104029062030","River","TF3277399099","heavily modified","532773","399099","3","Moderate or less","Element","Mitigation Measures Assessment","Agriculture and rural land management","Confirmed","RNAG",,"Physical modification","Confirmed","Other (not in list, must add details in comments)","Confirmed","Land drainage",,"588066","/catchment-planning/ReasonsForNotAchievingGood/588066","Physical modification","Physical modifications"
"Humber","Louth Grimsby and Ancholme","Becks Northern","Buck Beck from Source to N Sea","GB104029062110","River","TA3020906854","heavily modified","530209","406854","3","Moderate","Element","Phosphate","Urban and transport","Probable","RNAG","Urban","Diffuse source","Confirmed","Urbanisation - urban development","Probable",,,"582163","/catchment-planning/ReasonsForNotAchievingGood/582163","Phosphate","Pollution from towns, cities and transport"
"Humber","Louth Grimsby and Ancholme","Becks Northern","Skitter Beck / East Halton Beck","GB104029067655","River","TA1187019129","heavily modified","511870","419129","3","Moderate","Element","Invertebrates","Urban and transport","Suspected","RNAG","Air","Diffuse source","Suspected","Airports","Suspected","Other (not in list)","Not applicable","582302","/catchment-planning/ReasonsForNotAchievingGood/582302","Other","Pollution from towns, cities and transport"
"Humber","Louth Grimsby and Ancholme","Becks Northern","Laceby Beck / River Freshney Catchment (to N Sea)","GB104029067530","River","TA2264704230","heavily modified","522647","404230","3","Does Not Support Good","Element","Hydrological Regime","Water Industry","Confirmed","RNAG","Not applicable","Flow","Confirmed","Groundwater abstraction","Confirmed",,,"552242","/catchment-planning/ReasonsForNotAchievingGood/552242","Abstraction and flow","Changes to the natural flow and levels of water"
"Humber","Louth Grimsby and Ancholme","Becks Northern","Buck Beck from Source to N Sea","GB104029062110","River","TA3020906854","heavily modified","530209","406854","3","Moderate","Element","Phosphate","Agriculture and rural land management","Probable","RNAG","Agriculture - Arable","Diffuse source","Probable","Poor nutrient management","Probable",,,"582164","/catchment-planning/ReasonsForNotAchievingGood/582164","Phosphate","Pollution from rural areas"
"Humber","Louth Grimsby and Ancholme","Becks Northern","Mawnbridge Drain","GB104029067540","River","TA2418412135","heavily modified","524184","412135","3","Moderate or less","Element","Mitigation Measures Assessment","Local and Central Government","Confirmed","RNAG","Not applicable","Physical modification","Confirmed","Other (not in list, must add details in comments)","Confirmed","Flood protection",,"552290","/catchment-planning/ReasonsForNotAchievingGood/552290","Physical modification","Physical modifications"
"Humber","Louth Grimsby and Ancholme","Becks Northern","Black Dyke Catchment (trib of Louth Canal)","GB104029062000","River","TF3720393726","heavily modified","537203","393726","3","Poor","Element","Invertebrates","Agriculture and rural land management","Confirmed","RNAG","Agriculture - Arable","Physical modification","Confirmed","Land drainage","Confirmed","Morphology","Not applicable","548588","/catchment-planning/ReasonsForNotAchievingGood/548588","Physical modification","Physical modifications"
"Humber","Louth Grimsby and Ancholme","Becks Northern","North Beck Drain","GB104029067575","River","TA1934012096","heavily modified","519340","412096","3","Moderate or less","Element","Mitigation Measures Assessment","Urban and transport","Confirmed","RNAG","Not applicable","Physical modification","Confirmed","Other (not in list, must add details in comments)","Confirmed","Urbanisation",,"552304","/catchment-planning/ReasonsForNotAchievingGood/552304","Physical modification","Physical modifications"
"Humber","Louth Grimsby and Ancholme","Becks Northern","Buck Beck from Source to N Sea","GB104029062110","River","TA3020906854","heavily modified","530209","406854","3","Moderate or less","Element","Mitigation Measures Assessment","Agriculture and rural land management","Confirmed","RNAG",,"Physical modification","Confirmed","Other (not in list, must add details in comments)","Confirmed","Land drainage",,"588072","/catchment-planning/ReasonsForNotAchievingGood/588072","Physical modification","Physical modifications"
"Humber","Louth Grimsby and Ancholme","Becks Northern","Seven Towns North Eau","GB104029062140","River","TF3931299800","artificial","539312","399800","3","Fail","Element","Mercury and Its Compounds","No sector responsible","Not applicable","RNAG","Not applicable","measures delivered to address reason, awaiting recovery","Confirmed","Not applicable","Not applicable",,,"582184","/catchment-planning/ReasonsForNotAchievingGood/582184","Chemicals",
"Humber","Louth Grimsby and Ancholme","Becks Northern","Buck Beck from Source to N Sea","GB104029062110","River","TA3020906854","heavily modified","530209","406854","3","Fail","Element","Polybrominated diphenyl ethers (PBDE)","No sector responsible","Not applicable","RNAG","Not applicable","measures delivered to address reason, awaiting recovery","Confirmed","Not applicable","Not applicable",,,"582166","/catchment-planning/ReasonsForNotAchievingGood/582166","Chemicals",
"Humber","Louth Grimsby and Ancholme","Becks Northern","Barrow Beck","GB104029067605","River","TA0957318504","heavily modified","509573","418504","3","Poor","Element","Invertebrates","Water Industry","Probable","RNAG","Water supply","Flow","Probable","Groundwater abstraction","Probable","Hydrology","Not applicable","582290","/catchment-planning/ReasonsForNotAchievingGood/582290","Abstraction and flow","Changes to the natural flow and levels of water"
"Humber","Louth Grimsby and Ancholme","Becks Northern","Buck Beck from Source to N Sea","GB104029062110","River","TA3020906854","heavily modified","530209","406854","3","Moderate","Element","Phosphate","Water Industry","Probable","RNAG","Waste water treatment","Point source","Probable","Sewage discharge (intermittent)","Probable",,,"582165","/catchment-planning/ReasonsForNotAchievingGood/582165","Phosphate","Pollution from waste water"
"Humber","Louth Grimsby and Ancholme","Becks Northern","Laceby Beck / River Freshney Catchment (to N Sea)","GB104029067530","River","TA2264704230","heavily modified","522647","404230","3","Fail","Element","Mercury and Its Compounds","No sector responsible","Not applicable","RNAG","Not applicable","measures delivered to address reason, awaiting recovery","Confirmed","Not applicable","Not applicable",,,"582253","/catchment-planning/ReasonsForNotAchievingGood/582253","Chemicals",
"Humber","Louth Grimsby and Ancholme","Becks Northern","Black Dyke Catchment (trib of Louth Canal)","GB104029062000","River","TF3720393726","heavily modified","537203","393726","3","Fail","Element","Polybrominated diphenyl ethers (PBDE)","No sector responsible","Not applicable","RNAG","Not applicable","measures delivered to address reason, awaiting recovery","Confirmed","Not applicable","Not applicable",,,"582128","/catchment-planning/ReasonsForNotAchievingGood/582128","Chemicals",
"Humber","Louth Grimsby and Ancholme","Becks Northern","Land Dike Drain to Louth Canal (East)","GB104029062165","River","TF3551898359","heavily modified","535518","398359","3","Bad","Element","Invertebrates","No sector responsible","Not applicable","RNAG","Not applicable","Natural","Confirmed","Natural conditions - other","Confirmed","Salinity","Not applicable","582216","/catchment-planning/ReasonsForNotAchievingGood/582216","Salinity",
"Humber","Louth Grimsby and Ancholme","Becks Northern","Skitter Beck / East Halton Beck","GB104029067655","River","TA1187019129","heavily modified","511870","419129","3","Moderate","Element","Invertebrates","Domestic General Public","Suspected","RNAG","Domestic/General public","Point source","Suspected","Private Sewage Treatment","Suspected","Organic pollution","Not applicable","582304","/catchment-planning/ReasonsForNotAchievingGood/582304","Organic pollution","Pollution from towns, cities and transport"
"Humber","Louth Grimsby and Ancholme","Becks Northern","Thoresway Beck (trib of Waithe Beck)","GB104029062060","River","TF1904798173","not designated artificial or heavily modified","519047","398173","3","Fail","Element","Polybrominated diphenyl ethers (PBDE)","No sector responsible","Not applicable","RNAG","Not applicable","measures delivered to address reason, awaiting recovery","Confirmed","Not applicable","Not applicable",,,"582147","/catchment-planning/ReasonsForNotAchievingGood/582147","Chemicals",
"Humber","Louth Grimsby and Ancholme","Becks Northern","Black Dyke Catchment (trib of Louth Canal)","GB104029062000","River","TF3720393726","heavily modified","537203","393726","3","Poor","Element","Invertebrates","Agriculture and rural land management","Probable","RNAG","Agriculture - Arable","Flow","Probable","Land drainage","Probable","Hydrology","Not applicable","548589","/catchment-planning/ReasonsForNotAchievingGood/548589","Abstraction and flow","Changes to the natural flow and levels of water"
"Humber","Louth Grimsby and Ancholme","Becks Northern","Seven Towns North Eau","GB104029062140","River","TF3931299800","artificial","539312","399800","3","Moderate or less","Element","Mitigation Measures Assessment","Agriculture and rural land management","Confirmed","RNAG",,"Physical modification","Confirmed","Other (not in list, must add details in comments)","Confirmed","Land drainage",,"588073","/catchment-planning/ReasonsForNotAchievingGood/588073","Physical modification","Physical modifications"
"Humber","Louth Grimsby and Ancholme","Becks Northern","Barrow Beck","GB104029067605","River","TA0957318504","heavily modified","509573","418504","3","Poor","Element","Invertebrates","Agriculture and rural land management","Suspected","RNAG","Agriculture - Arable","Physical modification","Confirmed","Land drainage","Suspected","Morphology","Not applicable","582291","/catchment-planning/ReasonsForNotAchievingGood/582291","Physical modification","Physical modifications"
"Humber","Louth Grimsby and Ancholme","Becks Northern","Laceby Beck / River Freshney Catchment (to N Sea)","GB104029067530","River","TA2264704230","heavily modified","522647","404230","3","Bad","Element","Fish","Water Industry","Confirmed","RNAG","Not applicable","Flow","Confirmed","Groundwater abstraction","Confirmed","Hydrology","Not applicable","582254","/catchment-planning/ReasonsForNotAchievingGood/582254","Abstraction and flow","Changes to the natural flow and levels of water"
"Humber","Louth Grimsby and Ancholme","Becks Northern","Land Dike Drain to Louth Canal (West)","GB104029062162","River","TF3378297947","heavily modified","533782","397947","3","Moderate or less","Element","Mitigation Measures Assessment","Sector under investigation","Confirmed","RNAG","Not applicable","Physical modification","Confirmed","Other (not in list, must add details in comments)","Confirmed","Land drainage",,"552015","/catchment-planning/ReasonsForNotAchievingGood/552015","Physical modification","Physical modifications"
"Humber","Louth Grimsby and Ancholme","Becks Northern","Land Dike Drain to Louth Canal (West)","GB104029062162","River","TF3378297947","heavily modified","533782","397947","3","Moderate or less","Element","Mitigation Measures Assessment","Sector under investigation","Confirmed","RNAG","Not applicable","Physical modification","Confirmed","Other (not in list, must add details in comments)","Confirmed","Flood protection",,"552014","/catchment-planning/ReasonsForNotAchievingGood/552014","Physical modification","Physical modifications"
"Humber","Louth Grimsby and Ancholme","Becks Northern","Poulton Drain Catchment (trib of Louth Canal)","GB104029062010","River","TF3404094427","heavily modified","534040","394427","3","Fail","Element","Mercury and Its Compounds","No sector responsible","Not applicable","RNAG","Not applicable","measures delivered to address reason, awaiting recovery","Confirmed","Not applicable","Not applicable",,,"582129","/catchment-planning/ReasonsForNotAchievingGood/582129","Chemicals",
"Humber","Louth Grimsby and Ancholme","Becks Northern","Land Dike Drain to Louth Canal (East)","GB104029062165","River","TF3551898359","heavily modified","535518","398359","3","Bad","Element","Invertebrates","No sector responsible","Not applicable","RFD","Not applicable","Natural","Probable","Saline or other intrusion","Probable","Other (not in list)","Not applicable","582217","/catchment-planning/ReasonsForNotAchievingGood/582217","Other",
"Humber","Louth Grimsby and Ancholme","Becks Northern","Skitter Beck / East Halton Beck","GB104029067655","River","TA1187019129","heavily modified","511870","419129","3","Fail","Element","Polybrominated diphenyl ethers (PBDE)","No sector responsible","Not applicable","RNAG","Not applicable","measures delivered to address reason, awaiting recovery","Confirmed","Not applicable","Not applicable",,,"582305","/catchment-planning/ReasonsForNotAchievingGood/582305","Chemicals",
"Humber","Louth Grimsby and Ancholme","Becks Northern","Land Dike Drain to Louth Canal (West)","GB104029062162","River","TF3378297947","heavily modified","533782","397947","3","Good","Element","Phosphate","No sector responsible","Not applicable","RFD","Not applicable","High to Good deterioration, no action required  (RFD only)","Confirmed","Not applicable","Not applicable",,,"582211","/catchment-planning/ReasonsForNotAchievingGood/582211","Phosphate",
"Humber","Louth Grimsby and Ancholme","Becks Northern","North Beck Drain","GB104029067575","River","TA1934012096","heavily modified","519340","412096","3","Moderate or less","Element","Mitigation Measures Assessment","Agriculture and rural land management","Confirmed","RNAG",,"Physical modification","Confirmed","Other (not in list, must add details in comments)","Confirmed","Land drainage",,"588083","/catchment-planning/ReasonsForNotAchievingGood/588083","Physical modification","Physical modifications"
"Humber","Louth Grimsby and Ancholme","Becks Northern","Skitter Beck / East Halton Beck","GB104029067655","River","TA1187019129","heavily modified","511870","419129","3","Good","Element","Phosphate","Water Industry","Confirmed","RNAG","Waste water treatment","Point source","Confirmed","Sewage discharge (continuous)","Confirmed",,,"552389","/catchment-planning/ReasonsForNotAchievingGood/552389","Phosphate","Pollution from waste water"
"Humber","Louth Grimsby and Ancholme","Becks Northern","Seven Towns South Eau","GB104029062150","River","TF4091297037","artificial","540912","397037","3","Moderate or less","Element","Mitigation Measures Assessment","Agriculture and rural land management","Confirmed","RNAG",,"Physical modification","Confirmed","Other (not in list, must add details in comments)","Confirmed","Land drainage",,"588074","/catchment-planning/ReasonsForNotAchievingGood/588074","Physical modification","Physical modifications"
"Humber","Louth Grimsby and Ancholme","Becks Northern","Barrow Beck","GB104029067605","River","TA0957318504","heavily modified","509573","418504","3","Does Not Support Good","Element","Hydrological Regime","Water Industry","Probable","RNAG","Water supply","Flow","Probable","Groundwater abstraction","Probable",,,"573150","/catchment-planning/ReasonsForNotAchievingGood/573150","Abstraction and flow","Changes to the natural flow and levels of water"
"Humber","Louth Grimsby and Ancholme","Becks Northern","Buck Beck from Source to N Sea","GB104029062110","River","TA3020906854","heavily modified","530209","406854","3","Fail","Element","Benzo(b)fluoranthene","Sector under investigation","Not applicable","RNAG","Not applicable","Unknown (pending investigation)","Confirmed","Unknown (pending investigation)","Not applicable",,,"582167","/catchment-planning/ReasonsForNotAchievingGood/582167","No entry",
"Humber","Louth Grimsby and Ancholme","Becks Northern","Laceby Beck / River Freshney Catchment (to N Sea)","GB104029067530","River","TA2264704230","heavily modified","522647","404230","3","Bad","Element","Fish","Agriculture and rural land management","Probable","RNAG","Agriculture - Arable","Diffuse source","Probable","Poor soil management","Probable","Sediment","Not applicable","582255","/catchment-planning/ReasonsForNotAchievingGood/582255","Fine sediment","Pollution from rural areas"
"Humber","Louth Grimsby and Ancholme","Becks Northern","Land Dike Drain to Louth Canal (East)","GB104029062165","River","TF3551898359","heavily modified","535518","398359","3","Poor","Element","Dissolved oxygen","Agriculture and rural land management","Suspected","RNAG","Agriculture - Arable","Physical modification","Suspected","Land drainage","Suspected",,,"582218","/catchment-planning/ReasonsForNotAchievingGood/582218","Dissolved oxygen (DO)","Physical modifications"
"Humber","Louth Grimsby and Ancholme","Becks Northern","Skitter Beck / East Halton Beck","GB104029067655","River","TA1187019129","heavily modified","511870","419129","3","Moderate","Element","Macrophytes and Phytobenthos Combined","Water Industry","Confirmed","RNAG","Waste water treatment","Point source","Confirmed","Sewage discharge (continuous)","Confirmed","Nutrients","Phosphate","582306","/catchment-planning/ReasonsForNotAchievingGood/582306","Phosphate","Pollution from waste water"
"Humber","Louth Grimsby and Ancholme","Becks Northern","Seven Towns South Eau","GB104029062150","River","TF4091297037","artificial","540912","397037","3","Fail","Element","Polybrominated diphenyl ethers (PBDE)","No sector responsible","Not applicable","RNAG","Not applicable","measures delivered to address reason, awaiting recovery","Confirmed","Not applicable","Not applicable",,,"582197","/catchment-planning/ReasonsForNotAchievingGood/582197","Chemicals",
"Humber","Louth Grimsby and Ancholme","Becks Northern","Louth Canal","GB104029061990","River","TF3703694260","heavily modified","537036","394260","3","Does Not Support Good","Element","Hydrological Regime","No sector responsible","Not applicable","RNAG","Not applicable","Flow","Probable","No further action (Flow is below the EFI but NOT causing an ecological failure)","Probable",,,"582111","/catchment-planning/ReasonsForNotAchievingGood/582111","Abstraction and flow",
"Humber","Louth Grimsby and Ancholme","Becks Northern","Covenham Reservoir","GB30432209","Lake","TF3460796035","artificial","534607","396035","3","Moderate or less","Element","Mitigation Measures Assessment","Water Industry","Confirmed","RNAG","Not applicable","Physical modification","Confirmed","Other (not in list, must add details in comments)","Confirmed","Drinking water supply",,"573670","/catchment-planning/ReasonsForNotAchievingGood/573670","Physical modification","Physical modifications"
"Humber","Louth Grimsby and Ancholme","Becks Northern","Barrow Beck","GB104029067605","River","TA0957318504","heavily modified","509573","418504","3","Poor","Element","Invertebrates","Agriculture and rural land management","Suspected","RNAG","Agriculture - Livestock","Diffuse source","Suspected","Poor Livestock Management","Suspected","Sediment","Not applicable","582293","/catchment-planning/ReasonsForNotAchievingGood/582293","Fine sediment","Pollution from rural areas"
"Humber","Louth Grimsby and Ancholme","Becks Northern","Buck Beck from Source to N Sea","GB104029062110","River","TA3020906854","heavily modified","530209","406854","3","Fail","Element","Benzo(g-h-i)perylene","Sector under investigation","Not applicable","RNAG","Not applicable","Unknown (pending investigation)","Confirmed","Unknown (pending investigation)","Not applicable",,,"582168","/catchment-planning/ReasonsForNotAchievingGood/582168","No entry",
"Humber","Louth Grimsby and Ancholme","Becks Northern","Laceby Beck / River Freshney Catchment (to N Sea)","GB104029067530","River","TA2264704230","heavily modified","522647","404230","3","Bad","Element","Fish","Local and Central Government","Probable","RNAG","Environment, Farming, Rural","Physical modification","Probable","Barriers - ecological discontinuity","Probable","Morphology","Not applicable","582256","/catchment-planning/ReasonsForNotAchievingGood/582256","Physical modification","Physical modifications"
"Humber","Louth Grimsby and Ancholme","Becks Northern","Land Dike Drain to Louth Canal (East)","GB104029062165","River","TF3551898359","heavily modified","535518","398359","3","Poor","Element","Dissolved oxygen","Agriculture and rural land management","Suspected","RNAG","Agriculture - Arable","Diffuse source","Suspected","Poor nutrient management","Suspected",,,"582219","/catchment-planning/ReasonsForNotAchievingGood/582219","Dissolved oxygen (DO)","Pollution from rural areas"
"Humber","Louth Grimsby and Ancholme","Becks Northern","Skitter Beck / East Halton Beck","GB104029067655","River","TA1187019129","heavily modified","511870","419129","3","Moderate","Element","Macrophytes and Phytobenthos Combined","Agriculture and rural land management","Confirmed","RNAG","Agriculture - Arable","Physical modification","Confirmed","Land drainage","Confirmed","Morphology","Not applicable","582307","/catchment-planning/ReasonsForNotAchievingGood/582307","Physical modification","Physical modifications"
"Humber","Louth Grimsby and Ancholme","Becks Northern","Seven Towns South Eau","GB104029062150","River","TF4091297037","artificial","540912","397037","3","Bad","Element","Ammonia (Phys-Chem)","Water Industry","Confirmed","RNAG","Waste water treatment","Point source","Confirmed","Sewage discharge (continuous)","Confirmed",,,"551944","/catchment-planning/ReasonsForNotAchievingGood/551944","Ammonia","Pollution from waste water"