"uri","label","abnormal weather exception","bwq_bathing water > eubwid notation","bwq_bathing water > name","bwq_sampling point > sample point notation","bwq_sampling point > name","dataset","dataset > uri","entrovirus count","entrovirus qualifier > count qualifier notation","escherichia coli count","escherichia coli qualifier > count qualifier notation","faecal coliform count","faecal coliform qualifier > count qualifier notation","faecal streptococci count","faecal streptococci qualifier > count qualifier notation","intestinal enterococci count","intestinal enterococci qualifier > count qualifier notation","salmonella present > presence notation","salmonella present > name","sample classification > compliance code notation","sample classification > name","sample date time > in XSD date time","sample week","sample week > uri","source","source > uri","total coliform count","total coliform qualifier > count qualifier notation","type","type > uri"
"http://environment.data.gov.uk/data/bathing-water-quality/in-season/sample/point/38255/date/20120510/time/120000/recordDate/20120510","Sandy Haven sample assessment for 2012-W19","false","ukl1403-38255","Sandy Haven","38255","Sampling point at Sandy Haven","in-season","http://environment.data.gov.uk/data/bathing-water-quality/eaew/in-season",,,"3400","=",,,,,"1050","=",,,"F","Fail","2012-05-10T12:00:00","British Week:2012-W19","http://reference.data.gov.uk/id/week/2012-W19","line=000388","http://environment.data.gov.uk/sources/bwq/eaew/input/in-season-in-season-ea_bw_sample_update_20120516_post2012-less-sp37940-20120516-104532-8-20120717-075810-32.csv#line=000388",,,,"http://purl.org/linked-data/cube#Observation"
"http://environment.data.gov.uk/data/bathing-water-quality/in-season/sample/point/38255/date/20120510/time/120000/recordDate/20120510","Sandy Haven sample assessment for 2012-W19","false","ukl1403-38255","Sandy Haven","38255","Sampling point at Sandy Haven","in-season","http://environment.data.gov.uk/data/bathing-water-quality/eaew/in-season",,,"3400","=",,,,,"1050","=",,,"F","Fail","2012-05-10T12:00:00","British Week:2012-W19","http://reference.data.gov.uk/id/week/2012-W19","line=000388","http://environment.data.gov.uk/sources/bwq/eaew/input/in-season-in-season-ea_bw_sample_update_20120516_post2012-less-sp37940-20120516-104532-8-20120717-075810-32.csv#line=000388",,,,"http://environment.data.gov.uk/def/bathing-water-quality/SampleAssessment"
"http://environment.data.gov.uk/data/bathing-water-quality/in-season/sample/point/38260/date/20120510/time/104500/recordDate/20120510","Dale sample assessment for 2012-W19","false","ukl1403-38260","Dale","38260","Sampling point at Dale","in-season","http://environment.data.gov.uk/data/bathing-water-quality/eaew/in-season",,,"27","=",,,,,"10","<",,,"G","Higher","2012-05-10T10:45:00","British Week:2012-W19","http://reference.data.gov.uk/id/week/2012-W19","line=000364","http://environment.data.gov.uk/sources/bwq/eaew/input/in-season-in-season-ea_bw_sample_update_20120516_post2012-less-sp37940-20120516-104532-8-20120717-075810-32.csv#line=000364",,,,"http://purl.org/linked-data/cube#Observation"
"http://environment.data.gov.uk/data/bathing-water-quality/in-season/sample/point/38260/date/20120510/time/104500/recordDate/20120510","Dale sample assessment for 2012-W19","false","ukl1403-38260","Dale","38260","Sampling point at Dale","in-season","http://environment.data.gov.uk/data/bathing-water-quality/eaew/in-season",,,"27","=",,,,,"10","<",,,"G","Higher","2012-05-10T10:45:00","British Week:2012-W19","http://reference.data.gov.uk/id/week/2012-W19","line=000364","http://environment.data.gov.uk/sources/bwq/eaew/input/in-season-in-season-ea_bw_sample_update_20120516_post2012-less-sp37940-20120516-104532-8-20120717-075810-32.csv#line=000364",,,,"http://environment.data.gov.uk/def/bathing-water-quality/SampleAssessment"
"http://environment.data.gov.uk/data/bathing-water-quality/in-season/sample/point/38300/date/20120510/time/120000/recordDate/20120510","Broad Haven (Central) sample assessment for 2012-W19","false","ukl1403-38300","Broad Haven (Central)","38300","Sampling point at Broad Haven (Central)","in-season","http://environment.data.gov.uk/data/bathing-water-quality/eaew/in-season",,,"100","=",,,,,"55","=",,,"G","Higher","2012-05-10T12:00:00","British Week:2012-W19","http://reference.data.gov.uk/id/week/2012-W19","line=000389","http://environment.data.gov.uk/sources/bwq/eaew/input/in-season-in-season-ea_bw_sample_update_20120516_post2012-less-sp37940-20120516-104532-8-20120717-075810-32.csv#line=000389",,,,"http://purl.org/linked-data/cube#Observation"
"http://environment.data.gov.uk/data/bathing-water-quality/in-season/sample/point/38300/date/20120510/time/120000/recordDate/20120510","Broad Haven (Central) sample assessment for 2012-W19","false","ukl1403-38300","Broad Haven (Central)","38300","Sampling point at Broad Haven (Central)","in-season","http://environment.data.gov.uk/data/bathing-water-quality/eaew/in-season",,,"100","=",,,,,"55","=",,,"G","Higher","2012-05-10T12:00:00","British Week:2012-W19","http://reference.data.gov.uk/id/week/2012-W19","line=000389","http://environment.data.gov.uk/sources/bwq/eaew/input/in-season-in-season-ea_bw_sample_update_20120516_post2012-less-sp37940-20120516-104532-8-20120717-075810-32.csv#line=000389",,,,"http://environment.data.gov.uk/def/bathing-water-quality/SampleAssessment"
"http://environment.data.gov.uk/data/bathing-water-quality/in-season/sample/point/38340/date/20120510/time/113000/recordDate/20120510","Druidston Haven sample assessment for 2012-W19","false","ukl1403-38340","Druidston Haven","38340","Sampling point at Druidston Haven","in-season","http://environment.data.gov.uk/data/bathing-water-quality/eaew/in-season",,,"370","=",,,,,"118","=",,,"I","Minimum","2012-05-10T11:30:00","British Week:2012-W19","http://reference.data.gov.uk/id/week/2012-W19","line=000376","http://environment.data.gov.uk/sources/bwq/eaew/input/in-season-in-season-ea_bw_sample_update_20120516_post2012-less-sp37940-20120516-104532-8-20120717-075810-32.csv#line=000376",,,,"http://purl.org/linked-data/cube#Observation"
"http://environment.data.gov.uk/data/bathing-water-quality/in-season/sample/point/38340/date/20120510/time/113000/recordDate/20120510","Druidston Haven sample assessment for 2012-W19","false","ukl1403-38340","Druidston Haven","38340","Sampling point at Druidston Haven","in-season","http://environment.data.gov.uk/data/bathing-water-quality/eaew/in-season",,,"370","=",,,,,"118","=",,,"I","Minimum","2012-05-10T11:30:00","British Week:2012-W19","http://reference.data.gov.uk/id/week/2012-W19","line=000376","http://environment.data.gov.uk/sources/bwq/eaew/input/in-season-in-season-ea_bw_sample_update_20120516_post2012-less-sp37940-20120516-104532-8-20120717-075810-32.csv#line=000376",,,,"http://environment.data.gov.uk/def/bathing-water-quality/SampleAssessment"
"http://environment.data.gov.uk/data/bathing-water-quality/in-season/sample/point/38380/date/20120510/time/103500/recordDate/20120510","Nolton Haven sample assessment for 2012-W19","false","ukl1403-38380","Nolton Haven","38380","Sampling point at Nolton Haven","in-season","http://environment.data.gov.uk/data/bathing-water-quality/eaew/in-season",,,"2500","=",,,,,"1440","=",,,"F","Fail","2012-05-10T10:35:00","British Week:2012-W19","http://reference.data.gov.uk/id/week/2012-W19","line=000360","http://environment.data.gov.uk/sources/bwq/eaew/input/in-season-in-season-ea_bw_sample_update_20120516_post2012-less-sp37940-20120516-104532-8-20120717-075810-32.csv#line=000360",,,,"http://purl.org/linked-data/cube#Observation"
"http://environment.data.gov.uk/data/bathing-water-quality/in-season/sample/point/38380/date/20120510/time/103500/recordDate/20120510","Nolton Haven sample assessment for 2012-W19","false","ukl1403-38380","Nolton Haven","38380","Sampling point at Nolton Haven","in-season","http://environment.data.gov.uk/data/bathing-water-quality/eaew/in-season",,,"2500","=",,,,,"1440","=",,,"F","Fail","2012-05-10T10:35:00","British Week:2012-W19","http://reference.data.gov.uk/id/week/2012-W19","line=000360","http://environment.data.gov.uk/sources/bwq/eaew/input/in-season-in-season-ea_bw_sample_update_20120516_post2012-less-sp37940-20120516-104532-8-20120717-075810-32.csv#line=000360",,,,"http://environment.data.gov.uk/def/bathing-water-quality/SampleAssessment"
"http://environment.data.gov.uk/data/bathing-water-quality/in-season/sample/point/46500/date/19900710/time/000000/recordDate/19900710","Skinburness sample assessment for 1990-W28","false",,,,,"in-season","http://environment.data.gov.uk/data/bathing-water-quality/eaew/in-season","1","=",,,,,,,,,"n/a","not-assessed","N","Not Classified","1990-07-10T00:00:00","British Week:1990-W28","http://reference.data.gov.uk/id/week/1990-W28","line=210273","http://environment.data.gov.uk/sources/bwq/eaew/input/ea_bw_sample_2011_BWQ_BASELINE.csv#line=210273",,,,"http://purl.org/linked-data/cube#Observation"
"http://environment.data.gov.uk/data/bathing-water-quality/in-season/sample/point/46500/date/19900710/time/000000/recordDate/19900710","Skinburness sample assessment for 1990-W28","false",,,,,"in-season","http://environment.data.gov.uk/data/bathing-water-quality/eaew/in-season","1","=",,,,,,,,,"n/a","not-assessed","N","Not Classified","1990-07-10T00:00:00","British Week:1990-W28","http://reference.data.gov.uk/id/week/1990-W28","line=210273","http://environment.data.gov.uk/sources/bwq/eaew/input/ea_bw_sample_2011_BWQ_BASELINE.csv#line=210273",,,,"http://environment.data.gov.uk/def/bathing-water-quality/SampleAssessment"
"http://environment.data.gov.uk/data/bathing-water-quality/in-season/sample/point/46500/date/20010724/time/134100/recordDate/20010724","Skinburness sample assessment for 2001-W30","false",,,,,"in-season","http://environment.data.gov.uk/data/bathing-water-quality/eaew/in-season",,,,,"36","=","20","=",,,"n/a","not-assessed","G","Higher","2001-07-24T13:41:00","British Week:2001-W30","http://reference.data.gov.uk/id/week/2001-W30","line=210500","http://environment.data.gov.uk/sources/bwq/eaew/input/ea_bw_sample_2011_BWQ_BASELINE.csv#line=210500","9","=",,"http://purl.org/linked-data/cube#Observation"
"http://environment.data.gov.uk/data/bathing-water-quality/in-season/sample/point/46500/date/20010724/time/134100/recordDate/20010724","Skinburness sample assessment for 2001-W30","false",,,,,"in-season","http://environment.data.gov.uk/data/bathing-water-quality/eaew/in-season",,,,,"36","=","20","=",,,"n/a","not-assessed","G","Higher","2001-07-24T13:41:00","British Week:2001-W30","http://reference.data.gov.uk/id/week/2001-W30","line=210500","http://environment.data.gov.uk/sources/bwq/eaew/input/ea_bw_sample_2011_BWQ_BASELINE.csv#line=210500","9","=",,"http://environment.data.gov.uk/def/bathing-water-quality/SampleAssessment"
"http://environment.data.gov.uk/data/bathing-water-quality/in-season/sample/point/36900/date/20110922/time/141500/recordDate/20110922","Swansea Bay sample assessment for 2011-W38","false","ukl1800-36900","Swansea Bay","36900","Sampling point at Swansea Bay","in-season","http://environment.data.gov.uk/data/bathing-water-quality/eaew/in-season",,,,,"11","=","8","=",,,"n/a","not-assessed","G","Higher","2011-09-22T14:15:00","British Week:2011-W38","http://reference.data.gov.uk/id/week/2011-W38","line=000508","http://environment.data.gov.uk/sources/bwq/eaew/input/in-season-ea_bw_sample_update_20110927-1317121236641-20120320-154625-5.csv#line=000508","10","<",,"http://purl.org/linked-data/cube#Observation"
"http://environment.data.gov.uk/data/bathing-water-quality/in-season/sample/point/36900/date/20110922/time/141500/recordDate/20110922","Swansea Bay sample assessment for 2011-W38","false","ukl1800-36900","Swansea Bay","36900","Sampling point at Swansea Bay","in-season","http://environment.data.gov.uk/data/bathing-water-quality/eaew/in-season",,,,,"11","=","8","=",,,"n/a","not-assessed","G","Higher","2011-09-22T14:15:00","British Week:2011-W38","http://reference.data.gov.uk/id/week/2011-W38","line=000508","http://environment.data.gov.uk/sources/bwq/eaew/input/in-season-ea_bw_sample_update_20110927-1317121236641-20120320-154625-5.csv#line=000508","10","<",,"http://environment.data.gov.uk/def/bathing-water-quality/SampleAssessment"
"http://environment.data.gov.uk/data/bathing-water-quality/in-season/sample/point/46500/date/19900926/time/114500/recordDate/19900926","Skinburness sample assessment for 1990-W39","false",,,,,"in-season","http://environment.data.gov.uk/data/bathing-water-quality/eaew/in-season",,,,,"10","<",,,,,"n/a","not-assessed","I","Minimum","1990-09-26T11:45:00","British Week:1990-W39","http://reference.data.gov.uk/id/week/1990-W39","line=210284","http://environment.data.gov.uk/sources/bwq/eaew/input/ea_bw_sample_2011_BWQ_BASELINE.csv#line=210284","10","<",,"http://purl.org/linked-data/cube#Observation"
"http://environment.data.gov.uk/data/bathing-water-quality/in-season/sample/point/46500/date/19900926/time/114500/recordDate/19900926","Skinburness sample assessment for 1990-W39","false",,,,,"in-season","http://environment.data.gov.uk/data/bathing-water-quality/eaew/in-season",,,,,"10","<",,,,,"n/a","not-assessed","I","Minimum","1990-09-26T11:45:00","British Week:1990-W39","http://reference.data.gov.uk/id/week/1990-W39","line=210284","http://environment.data.gov.uk/sources/bwq/eaew/input/ea_bw_sample_2011_BWQ_BASELINE.csv#line=210284","10","<",,"http://environment.data.gov.uk/def/bathing-water-quality/SampleAssessment"
"http://environment.data.gov.uk/data/bathing-water-quality/in-season/sample/point/46500/date/19950627/time/104500/recordDate/19950627","Skinburness sample assessment for 1995-W26","false",,,,,"in-season","http://environment.data.gov.uk/data/bathing-water-quality/eaew/in-season",,,,,"10","=","10","<",,,"n/a","not-assessed","G","Higher","1995-06-27T10:45:00","British Week:1995-W26","http://reference.data.gov.uk/id/week/1995-W26","line=210373","http://environment.data.gov.uk/sources/bwq/eaew/input/ea_bw_sample_2011_BWQ_BASELINE.csv#line=210373","10","=",,"http://purl.org/linked-data/cube#Observation"
"http://environment.data.gov.uk/data/bathing-water-quality/in-season/sample/point/46500/date/19950627/time/104500/recordDate/19950627","Skinburness sample assessment for 1995-W26","false",,,,,"in-season","http://environment.data.gov.uk/data/bathing-water-quality/eaew/in-season",,,,,"10","=","10","<",,,"n/a","not-assessed","G","Higher","1995-06-27T10:45:00","British Week:1995-W26","http://reference.data.gov.uk/id/week/1995-W26","line=210373","http://environment.data.gov.uk/sources/bwq/eaew/input/ea_bw_sample_2011_BWQ_BASELINE.csv#line=210373","10","=",,"http://environment.data.gov.uk/def/bathing-water-quality/SampleAssessment"
